请选择 进入手机版 | 继续访问电脑版

[其他] 编译自定义loader失败

[复制链接]
cklein 发表于 2021-8-10 11:00:52
2021-08-10 11:00:03/uzmap/temp/p4QBR9uqMPOtOi5/AStudioProject/app/build/intermediates/external_file_lib_dex_archives/release/out/9_apiEngine v3.0.0.jar: D8: File not found: /uzmap/temp/p4QBR9uqMPOtOi5/AStudioProject/app/build/intermediates/external_file_lib_dex_archives/release/out/9_apiEngine v3.0.0.jar/uzmap/temp/p4QBR9uqMPOtOi5/AStudioProject/app/build/intermediates/external_file_lib_dex_archives/release/out/9_apiEngine v3.0.0.jar: D8: File not found: /uzmap/temp/p4QBR9uqMPOtOi5/AStudioProject/app/build/intermediates/external_file_lib_dex_archives/release/out/9_apiEngine v3.0.0.jarFAILURE: **.**pleted with 3 failures.1: Task failed with an exception.-----------* What went wrong:Execution failed for task ':app:mergeReleaseJavaResource'.> A failure occurred **.**android.build.gradle.internal.tasks.Workers$ActionFacade   > java.io.IOException: File does not exist but read-only mode requested* Try:Run with --stacktrace option to get the stack trace. Run with --info or --debug option to get more log output. Run with --scan to get full insights.==============================================================================2: Task failed with an exception.-----------* What went wrong:Execution failed for task ':app:mergeReleaseNativeLibs'.> A failure occurred **.**android.build.gradle.internal.tasks.Workers$ActionFacade   > java.lang.AssertionError (no error message)* Try:Run with --stacktrace option to get the stack trace. Run with --info or --debug option to get more log output. Run with --scan to get full insights.==============================================================================3: Task failed with an exception.-----------* What went wrong:Execution failed for task ':app:desugarReleaseFileDependencies'.> A failure occurred **.**android.build.gradle.internal.tasks.Workers$ActionFacade   > Error while dexing.* Try:Run with --stacktrace option to get the stack trace. Run with --info or --debug option to get more log output. Run with --scan to get full insights.==============================================================================* Get more help at https://**.**BUILD FAILED in 22s

1条回复

技术支持-F 管理员 26194Y币
有哪些模块,有自定义模块吗
您需要登录后才可以回帖 登录

本版积分规则