请选择 进入手机版 | 继续访问电脑版
热门问答
更多

[云引擎] 引用三方aarSDK自定义模块,云端编译自定义loader报错

[复制链接]
seling 发表于 2021-11-22 09:31:39
2021-11-22 09:28:38FAILURE: Build failed with an exception.* What went wrong:Execution failed for task ':app:processReleaseResources'.> A failure occurred while executing com.android.build.gradle.internal.tasks.Workers$ActionFacade   > Android resource linking failed     AAPT: error: resource style/Theme.AppCompat.Light.NoActionBar (aka com.seling.grw:style/Theme.AppCompat.Light.NoActionBar) not found.     error: failed linking references.              * Try:Run with --stacktrace option to get the stack trace. Run with --info or --debug option to get more log output. Run with --scan to get full insights.* Get more help at https://help**.**BUILD FAILED in 21s

6条回复

Arly【520707liu】 版主 14751Y币
缺少依赖包,可以用下边的自定义模块包

https://developer.yonyou.com/thread-191332-1-1.html

commonResource  apicloud 后台上传自定义模块
seling 驾校小白 32Y币
上传了三方sdk的aar文件,按照自定模块的说明将三方aar文件放到自己开发的自定义模块包里一起压缩为zip上传 。 但是编译就是不通过
seling 驾校小白 32Y币
是要把那个里面的所有依赖包全部放到zip压缩包里面吗?
520707liu · 2021-11-22 09:51缺少依赖包,可以用下边的自定义模块包

https://developer.yonyou.com/thread-191332-1-1.html
seling 驾校小白 32Y币
好的 将commonResource放到里面试试。 谢谢!
520707liu · 2021-11-22 09:51缺少依赖包,可以用下边的自定义模块包

https://developer.yonyou.com/thread-191332-1-1.html
seling 驾校小白 32Y币
谢谢, 的确是因为这个原因。
520707liu · 2021-11-22 09:51缺少依赖包,可以用下边的自定义模块包

https://developer.yonyou.com/thread-191332-1-1.html
Arly【520707liu】 版主 14751Y币
赞赞赞
seling · 2021-11-22 13:30谢谢, 的确是因为这个原因。
您需要登录后才可以回帖 登录

本版积分规则