请选择 进入手机版 | 继续访问电脑版
热门问答
更多

[云开发] 云编译是出现错误,和wifi调试时候出现ajpush.init undefined

[复制链接]
BIP220133 发表于 2022-8-4 11:21:20
云编译报错2022-08-04 11:03:16/uzmap/temp/yo2ICKYgtA9UOWK/AStudioProject/app/src/main/AndroidManifest.xml:16:13-77 Error:        Attribute activity#com.uzmap.pkg.uzmodules.uzVideoPlayer.VideoActivity@theme value=(@android:style/Theme.Black.NoTitleBar.Fullscreen) from [videoplayer-release.aar] AndroidManifest.xml:16:13-77        is also present at [movieplayerModule-release.aar] AndroidManifest.xml:16:13-44 value=(@style/AppTheme).        Suggestion: add 'tools:replace="android:theme"' to <activity> element at AndroidManifest.xml:12:9-16:80 to override.FAILURE: Build failed with an exception.* What went wrong:Execution failed for task ':app:processReleaseManifest'.> Manifest merger failed with multiple errors, see logs* Try:Run with --stacktrace option to get the stack trace. Run with --info or --debug option to get more log output. Run with --scan to get full insights.* Get more help at https://help**.**BUILD FAILED in 12s

ajpush.init [ERROR] Uncaught TypeError: Cannot read properties of undefined (reading 'init')

3条回复

技术咨询-F 管理员 28882Y币
videoplayer   movieplayer  去掉一个
BIP220133 驾校小白 21Y币
ajpush.init 这个我添加模块了,但是初始化说init未定义
勇可可 版主 318364Y币
如何 添加模块的 config修改之后  要提交代码再编译
BIP220133 · 2022-8-4 15:07ajpush.init 这个我添加模块了,但是初始化说init未定义
您需要登录后才可以回帖 登录

本版积分规则